[ADMB Users] Compile Error

Derek Seiple dseiple84 at gmail.com
Mon Apr 25 07:13:37 PDT 2011

I just checked out some code and tried to compile it, but I got this
error. Has anyone else experienced this?

Thanks, -Derek-

df1b2lp9.cpp: In member function ‘dvector
dvector&, function_minimizer*)’:
df1b2lp9.cpp:66: error: request for member ‘use_control_c’ in ‘*(pfmc1
+ ((unsigned int)(((unsigned int)i) * 4u)))’, which is of non-class
type ‘fmm*’
make[2]: *** [df1b2lp9.obj] Error 1
make[2]: Leaving directory `/home/dseiple/admb-test/src/df1b2-separable'
make[1]: *** [dist] Error 2
make[1]: Leaving directory `/home/dseiple/admb-test/src'
make: *** [linux] Error 2

More information about the Users mailing list